This Confluence has been LDAP enabled, if you are an ASF Committer, please use your LDAP Credentials to login. Any problems file an INFRA jira ticket please.

Child pages
  • pleas help!
Skip to end of metadata
Go to start of metadata

i study Jenkins and maven and i cant do some  job the problem is:

 BUILD FAILURE
[INFO] ------------------------------------------------------------------------
[INFO] Total time: 25.424 s
[INFO] Finished at: 2018-10-21T11:02:51+03:00
[INFO] ------------------------------------------------------------------------
[ERROR] Failed to execute goal org.apache.maven.plugins:maven-surefire-plugin:2.21.0:test (default-test) on project spring-boot-sample-web-ui: There are test failures. [ERROR] [ERROR] Please refer to /var/lib/jenkins/workspace/maven-project/target/surefire-reports for the individual test results. [ERROR] Please refer to dump files (if any exist) [date]-jvmRun[N].dump, [date].dumpstream and [date]-jvmRun[N].dumpstream. [ERROR] -> [Help 1] [ERROR] [ERROR] To see the full stack trace of the errors, re-run Maven with the -e switch. [ERROR] Re-run Maven using the -X switch to enable full debug logging. [ERROR] [ERROR] For more information about the errors and possible solutions, please read the following articles: [ERROR] [Help 1] http://cwiki.apache.org/confluence/display/MAVEN/MojoFailureException Build step 'Invoke top-level Maven targets' marked build as failure
Finished: FAILURE
  • No labels

1 Comment

  1. Ismael Juma What is this page? Should we delete it?